Bug fixing

6 jobs for optimise-logging in 3 minutes and 49 seconds (queued for 1 second)
latest
Status Job ID Name Coverage
  Static Analysis
failed #7242
docker
Format

00:01:52

failed #7243
docker
Lint

00:01:56

 
  Build
skipped #7244
docker
Documentation
 
  Test
skipped #7246
docker
Authorisation Disabled
skipped #7247
docker
Centos7
skipped #7245
docker
Default
 
Name Stage Failure
failed
Lint Static Analysis
1 error generated.
make[2]: Leaving directory '/builds/performance/storage/deimos/build'
make[2]: *** [src/storage/phobos/phobos_cpp_wrapper/CMakeFiles/phobos_cpp_wrapper.dir/build.make:66: src/storage/phobos/phobos_cpp_wrapper/CMakeFiles/phobos_cpp_wrapper.dir/phobos_cpp_wrapper.c.o] Error 1
make[1]: *** [CMakeFiles/Makefile2:216: src/storage/phobos/phobos_cpp_wrapper/CMakeFiles/phobos_cpp_wrapper.dir/all] Error 2
make: *** [Makefile:144: all] Error 2
make[1]: Leaving directory '/builds/performance/storage/deimos/build'
make: Leaving directory '/builds/performance/storage/deimos/build'
Cleaning up file based variables
ERROR: Job failed: exit code 1
failed
Format Static Analysis
	modified:   src/main.cc
modified: src/protocol/s3/s3_errors.hh
modified: src/stream/fifo/fifo.hh
modified: src/utils/config.cc

no changes added to commit (use "git add" and/or "git commit -a")
This commit contains unformatted files! Run tools/run_format.sh on the project to format them correctly.
Cleaning up file based variables
ERROR: Job failed: exit code 1